{"text_format":"1","workbook":"xlsx","n_sheets":7,"sheets":["作成に係る計算表","協定参加者別","個人配布用","減価償却計算","償却率","作成に係る計算表 (記入例)","協定参加者別 (記入例)"],"not_rendered":{"charts":0,"images":0,"macros":0,"external_links":0,"defined_names":9,"comments":2,"pivot_tables":0},"unopened":[],"bounds":{"document_bytes":16777216,"sheet_cells":100000,"rows_first":2000,"rows_last":500,"rows_between":2000,"halvings":0,"cell_chars":16384,"cell_head_chars":4096},"cells_cut":0,"cells_raw":0,"read":"whole","date_system":"1900"}

{"sheet":"作成に係る計算表","index":0,"n_rows":88,"n_cols":63,"rows_kept":88,"cut":false,"hidden":false,"merged":[[0,59,0,60],[0,53,0,54],[0,55,0,56],[0,57,0,58],[0,19,0,21],[0,38,0,41],[0,42,0,45],[0,27,0,36],[0,0,0,8],[0,9,0,17],[7,1,7,7],[7,8,7,12],[7,13,7,25],[1,0,1,25],[5,8,5,12],[5,13,5,25],[6,8,6,12],[6,13,6,25],[2,22,2,24],[2,18,2,21],[5,1,5,7],[6,1,6,7],[8,1,8,7],[8,8,8,12],[8,13,8,25],[14,3,14,10],[13,16,13,25],[12,11,12,15],[12,16,12,25],[13,11,13,15],[14,16,14,25],[11,16,11,25],[13,3,13,10],[25,16,25,20],[25,21,25,25],[10,1,10,10],[10,11,10,15],[25,11,25,15],[25,1,25,10],[24,11,24,15],[24,16,24,25],[20,16,20,25],[22,16,22,25],[10,16,10,25],[11,11,11,15],[17,16,17,25],[18,11,18,15],[18,16,18,25],[14,11,14,15],[23,11,23,15],[23,16,23,25],[19,16,19,25],[22,11,22,15],[19,11,19,15],[21,11,21,15],[21,16,21,25],[20,11,20,15],[16,11,16,15],[15,16,15,25],[16,16,16,25],[17,11,17,15],[15,11,15,15],[24,2,24,10],[11,2,14,2],[11,1,22,1],[15,2,15,10],[16,2,16,10],[17,2,17,10],[18,2,18,10],[19,2,19,10],[20,2,20,10],[21,2,21,10],[22,2,22,10],[23,1,23,10],[11,3,11,10],[12,3,12,10]]}
["STEP①：下記の計算表の作成する。",null,null,null,null,null,null,null,null,"STEP②：共同取組配分方法の選択→",null,null,null,null,null,null,null,null,null,"面積割",null,null,null,null,null,null,null,"STEP③：参加者別に個人配分額、日当等受領額、共同取組割当の適用の有無を入力する。",null,null,null,null,null,null,null,null,null,null,"STEP④：端数がある場合は端数調整額を入力",null,null,null,null,null,null,null,null,null,null,null,null,null,null,"STEP⑤減価償却資産取得額を入力→",null,null,null,"STEP⑥原価償却費を入力→",null,null,null,null,"STEP⑦：協定参加者別シートへ移動"]
["収支状況報告書作成に係る計算表",null,null,null,null,null,null,null,null,null,null,null,null,null,null,null,null,null,null,null,null,null,null,null,null,null,null,null,"合計",{"$f":"SUM(AD4:AD88)","v":0},{"$f":"COUNTIF(AE4:AE88,\"有\")","v":0},{"$f":"SUM(AF4:AF88)","v":0},{"$f":"SUM(AG4:AG88)","v":0},{"$f":"SUM(AH4:AH88)","v":0},null,null,null,null,"合計",{"$f":"SUM(AN4:AN88)","v":0},{"$f":"I8-AN2","v":0},{"$f":"SUM(AP4:AP88)","v":0},{"$f":"I8-AP2","v":0},null,{"$f":"SUM(AS4:AS88)","v":0},{"$f":"L24-AS2","v":0},{"$f":"SUM(AU4:AU88)","v":0},{"$f":"L24-AU2","v":0},{"$f":"SUM(AW4:AW88)","v":0},{"$f":"L25-AW2","v":0},{"$f":"SUM(AY4:AY88)","v":0},{"$f":"L25-AY2","v":0},null,{"$f":"SUM(BB4:BB88)","v":0},{"$f":"BD1-BB2","v":0},{"$f":"SUM(BD4:BD88)","v":0},{"$f":"BD1-BD2","v":0},{"$f":"SUM(BF4:BF88)","v":0},{"$f":"BH1-BF2","v":0},{"$f":"SUM(BH4:BH88)","v":0},{"$f":"BH1-BH2","v":0}]
[null,null,null,null,null,null,null,null,null,null,null,null,null,null,null,null,null,null,"○○",null,null,null,"集落協定",null,null,null,null,"No","参加者氏名","個人配分額","共同取組割当の適用","共同取組割当額","日当等受領額","共同取組支出額","必要経費に該当しない支出額","原価償却資産取得費","原価償却費",null,"個人配分額順位","共同(均等割）\n端数切捨","端数調整↓","共同(面積割）\n端数切捨","端数調整↓","個人配分割合","共同支出額\n(均等割）端数切捨","端数調整↓","共同支出額\n(面積割）端数切捨","端数調整↓","経費以外\n支出額（均等割）","端数調整↓","経費以外\n支出額（面積割）","端数調整↓",null,"減価償却資産取得額（均等割）","端数調整↓","減価償却資産取得額（面積割）","端数調整↓","減価償却費（均等割）","端数調整↓","減価償却費（面積割）","端数調整↓"]
["１　交付金に係る配分額及び共同取組活動の支出額",null,null,null,null,null,null,null,null,null,null,null,null,null,null,null,null,null,null,null,null,null,null,null,null,null,null,1,null,null,null,{"$f":"IF(AN4=\"\",\"\",IF($T$1=\"均等割\",AN4+AO4,AP4+AQ4))","v":""},null,{"$f":"IF(AN4=\"\",\"\",IF($T$1=\"均等割\",AS4+AT4,AU4+AV4))","v":""},{"$f":"IF(AN4=\"\",\"\",IF($T$1=\"均等割\",AW4+AX4,AY4+AZ4))","v":""},{"$f":"IF(AN4=\"\",\"\",IF($T$1=\"均等割\",BB4+BC4,BD4+BE4))","v":""},{"$f":"IF(AN4=\"\",\"\",IF($T$1=\"均等割\",BF4+BG4,BH4+BI4))","v":""},null,{"$f":"_xlfn.RANK.AVG(AD4,$AD$4:$AD$88)","v":{"$error":"#N/A"}},{"$f":"IF(AE4=\"有\",ROUNDDOWN($I$8/$AE$2,0),IF(AE4=\"無\",0,\"\"))","v":""},null,{"$f":"IF(AE4=\"有\",ROUNDDOWN($I$8*AR4,0),IF(AE4=\"無\",0,\"\"))","v":""},null,{"$f":"AD4/$I$7","v":{"$error":"#DIV/0!"}},{"$f":"IF(AE4=\"有\",ROUNDDOWN($L$24/$AE$2,0),IF(AE4=\"無\",0,\"\"))","v":""},null,{"$f":"IF(AE4=\"有\",ROUNDDOWN($L$24*AR4,0),IF(AE4=\"無\",0,\"\"))","v":""},null,{"$f":"IF(AE4=\"有\",ROUNDDOWN($L$25/$AE$2,0),IF(AE4=\"無\",0,\"\"))","v":""},null,{"$f":"IF(AE4=\"有\",ROUNDDOWN(AR4*$L$25,0),IF(AE4=\"無\",0,\"\"))","v":""},null,null,{"$f":"IF(AE4=\"有\",ROUNDDOWN($BD$1/$AE$2,0),IF(AE4=\"無\",0,\"\"))","v":""},null,{"$f":"IF(AE4=\"有\",ROUNDDOWN(AR4*$BD$1,0),IF(AE4=\"無\",0,\"\"))","v":""},null,{"$f":"IF(AE4=\"有\",ROUNDDOWN($BH$1/$AE$2,0),IF(AE4=\"無\",0,\"\"))","v":""},null,{"$f":"IF(AE4=\"有\",ROUNDDOWN(AR4*$BH$1,0),IF(AE4=\"無\",0,\"\"))","v":""}]
["（１）配分総額",null,null,null,null,null,null,null,null,null,null,null,null,null,null,null,null,null,null,null,null,null,null,null,null,null,null,2,null,null,null,{"$f":"IF(AN5=\"\",\"\",IF($T$1=\"均等割\",AN5+AO5,AP5+AQ5))","v":""},null,{"$f":"IF(AN5=\"\",\"\",IF($T$1=\"均等割\",AS5+AT5,AU5+AV5))","v":""},{"$f":"IF(AN5=\"\",\"\",IF($T$1=\"均等割\",AW5+AX5,AY5+AZ5))","v":""},{"$f":"IF(AN5=\"\",\"\",IF($T$1=\"均等割\",BB5+BC5,BD5+BE5))","v":""},{"$f":"IF(AN5=\"\",\"\",IF($T$1=\"均等割\",BF5+BG5,BH5+BI5))","v":""},null,{"$f":"_xlfn.RANK.AVG(AD5,$AD$4:$AD$88)","v":{"$error":"#N/A"}},"",null,"",null,{"$f":"AD5/$I$7","v":{"$error":"#DIV/0!"}},{"$f":"IF(AE5=\"有\",ROUNDDOWN($L$24/$AE$2,0),IF(AE5=\"無\",0,\"\"))","v":""},null,{"$f":"IF(AE5=\"有\",ROUNDDOWN($L$24*AR5,0),IF(AE5=\"無\",0,\"\"))","v":""},null,{"$f":"IF(AE5=\"有\",ROUNDDOWN($L$25/$AE$2,0),IF(AE5=\"無\",0,\"\"))","v":""},null,{"$f":"IF(AE5=\"有\",ROUNDDOWN(AR5*$L$25,0),IF(AE5=\"無\",0,\"\"))","v":""},null,null,{"$f":"IF(AE5=\"有\",ROUNDDOWN($BD$1/$AE$2,0),IF(AE5=\"無\",0,\"\"))","v":""},null,{"$f":"IF(AE5=\"有\",ROUNDDOWN(AR5*$BD$1,0),IF(AE5=\"無\",0,\"\"))","v":""},null,{"$f":"IF(AE5=\"有\",ROUNDDOWN($BH$1/$AE$2,0),IF(AE5=\"無\",0,\"\"))","v":""},null,{"$f":"IF(AE5=\"有\",ROUNDDOWN(AR5*$BH$1,0),IF(AE5=\"無\",0,\"\"))","v":""}]
[null,null,null,null,null,null,null,null,"総  額（円）",null,null,null,null,"配分等の基礎",null,null,null,null,null,null,null,null,null,null,null,null,null,3,null,null,null,"",null,"","","","",null,{"$error":"#N/A"},"",null,"",null,{"$error":"#DIV/0!"},"",null,"",null,"",null,"",null,null,"",null,"",null,"",null,""]
[null,"①個人配分分",null,null,null,null,null,null,null,null,null,null,null,null,null,null,null,null,null,null,null,null,null,null,null,null,null,4,null,null,null,"",null,"","","","",null,{"$error":"#N/A"},"",null,"",null,{"$error":"#DIV/0!"},"",null,"",null,"",null,"",null,null,"",null,"",null,"",null,""]
[null,"②共同取組活動分",null,null,null,null,null,null,null,null,null,null,null,null,null,null,null,null,null,null,null,null,null,null,null,null,null,5,null,null,null,"",null,"","","","",null,{"$error":"#N/A"},"",null,"",null,{"$error":"#DIV/0!"},"",null,"",null,"",null,"",null,null,"",null,"",null,"",null,""]
[null,"③合計",null,null,null,null,null,null,{"$f":"SUM(I7:M8)","v":0},null,null,null,null,null,null,null,null,null,null,null,null,null,null,null,null,null,null,6,null,null,null,"",null,"","","","",null,{"$error":"#N/A"},"",null,"",null,{"$error":"#DIV/0!"},"",null,"",null,"",null,"",null,null,"",null,"",null,"",null,""]
["（２）共同取組活動支出額",null,null,null,null,null,null,null,null,null,null,null,null,null,null,null,null,null,null,null,null,null,null,null,null,null,null,7,null,null,null,"",null,"","","","",null,{"$error":"#N/A"},"",null,"",null,{"$error":"#DIV/0!"},"",null,"",null,"",null,"",null,null,"",null,"",null,"",null,""]
[null,"支出項目",null,null,null,null,null,null,null,null,null,"支出額（円）",null,null,null,null,"備考",null,null,null,null,null,null,null,null,null,null,8,null,null,null,"",null,"","","","",null,{"$error":"#N/A"},"",null,"",null,{"$error":"#DIV/0!"},"",null,"",null,"",null,"",null,null,"",null,"",null,"",null,""]
[null,"⑤共同取組活動費","④役員報酬等","役員報酬",null,null,null,null,null,null,null,null,null,null,null,null,null,null,null,null,null,null,null,null,null,null,null,9,null,null,null,"",null,"","","","",null,{"$error":"#N/A"},"",null,"",null,{"$error":"#DIV/0!"},"",null,"",null,"",null,"",null,null,"",null,"",null,"",null,""]
[null,null,null,"日当",null,null,null,null,null,null,null,null,null,null,null,null,null,null,null,null,null,null,null,null,null,null,null,10,null,null,null,"",null,"","","","",null,{"$error":"#N/A"},"",null,"",null,{"$error":"#DIV/0!"},"",null,"",null,"",null,"",null,null,"",null,"",null,"",null,""]
[null,null,null,"その他手当等",null,null,null,null,null,null,null,null,null,null,null,null,null,null,null,null,null,null,null,null,null,null,null,11,null,null,null,"",null,"","","","",null,{"$error":"#N/A"},"",null,"",null,{"$error":"#DIV/0!"},"",null,"",null,"",null,"",null,null,"",null,"",null,"",null,""]
[null,null,null,"④合計額",null,null,null,null,null,null,null,{"$f":"SUM(L12:P14)","v":0},null,null,null,null,null,null,null,null,null,null,null,null,null,null,null,12,null,null,null,"",null,"","","","",null,{"$error":"#N/A"},"",null,"",null,{"$error":"#DIV/0!"},"",null,"",null,"",null,"",null,null,"",null,"",null,"",null,""]
[null,null,null,null,null,null,null,null,null,null,null,null,null,null,null,null,null,null,null,null,null,null,null,null,null,null,null,13,null,null,null,"",null,"","","","",null,{"$error":"#N/A"},"",null,"",null,{"$error":"#DIV/0!"},"",null,"",null,"",null,"",null,null,"",null,"",null,"",null,""]
[null,null,null,null,null,null,null,null,null,null,null,null,null,null,null,null,null,null,null,null,null,null,null,null,null,null,null,14,null,null,null,"",null,"","","","",null,{"$error":"#N/A"},"",null,"",null,{"$error":"#DIV/0!"},"",null,"",null,"",null,"",null,null,"",null,"",null,"",null,""]
[null,null,null,null,null,null,null,null,null,null,null,null,null,null,null,null,null,null,null,null,null,null,null,null,null,null,null,15,null,null,null,"",null,"","","","",null,{"$error":"#N/A"},"",null,"",null,{"$error":"#DIV/0!"},"",null,"",null,"",null,"",null,null,"",null,"",null,"",null,""]
[null,null,null,null,null,null,null,null,null,null,null,null,null,null,null,null,null,null,null,null,null,null,null,null,null,null,null,16,null,null,null,"",null,"","","","",null,{"$error":"#N/A"},"",null,"",null,{"$error":"#DIV/0!"},"",null,"",null,"",null,"",null,null,"",null,"",null,"",null,""]
[null,null,null,null,null,null,null,null,null,null,null,null,null,null,null,null,null,null,null,null,null,null,null,null,null,null,null,17,null,null,null,"",null,"","","","",null,{"$error":"#N/A"},"",null,"",null,{"$error":"#DIV/0!"},"",null,"",null,"",null,"",null,null,"",null,"",null,"",null,""]
{"$rows_left_out":69}
{"sheet":"協定参加者別","index":1,"n_rows":103,"n_cols":14,"rows_kept":103,"cut":false,"hidden":false,"merged":[[3,0,3,13],[4,0,4,13],[6,10,6,11],[0,1,0,3],[0,4,0,8],[1,12,1,13],[12,0,15,0],[12,1,15,1],[12,6,12,11],[12,2,12,5],[13,2,13,4],[13,6,13,9],[8,10,8,12],[14,11,15,11],[10,11,10,12],[12,13,15,13],[14,6,15,6],[12,12,14,12],[14,10,15,10]]}
[null,"STEP⑧：代表者名及び該当行政区を入力する。",null,null,"STEP⑨：減価償却資産の取得金額及び減価償却費がある場合は入力する。",null,null,null,null,"STEP⑩：印刷する。"]
[null,null,null,null,null,null,null,null,null,null,null,null,"平成　　　年　　　月　　　日"]
[]
["○○　　　年分【○○　年1月1日～○○　年12月31日】"]
["確定申告に係る中山間地域等直接支払交付金収支状況報告書"]
[]
[null,null,null,null,null,null,null,null,null,"集落協定名",{"$f":"IF(作成に係る計算表!S3=\"\",\"\",作成に係る計算表!S3)","v":"○○"},null,"集落協定"]
[]
[null,null,null,null,null,null,null,null,null,"集落協定代表者",null,null,null,"㊞"]
[]
[null,null,null,null,null,null,null,null,null,"該当行政区名","町"]
[]
["No.","氏名","収入",null,null,null,"支出",null,null,null,null,null,"所得金額","備考"]
[null,null,"交付金",null,null,"役員報酬等","⑤　共同取組活動分",null,null,null,"⑨","⑩"]
[null,null,"①","②","③　","④","支出額\n","⑥　⑤のうち","⑦　⑤のうち","⑧","減価償却費","必要経費\n（⑧+⑨）"]
[null,null,"個人配分分","共同取組活動分","合計\n（①＋②）","個人が受領した額",null,"必要経費に該当しない支出額","減価償却資産\nの取得金額","差引計\n（⑤-⑥-⑦）",null,null,"（③-⑩＋④）"]
[null,null,"円","円","円","円","円","円","円","円","円","円","円"]
[null,"集落合計",{"$f":"SUM(C19:C103)","v":0},{"$f":"SUM(D19:D103)","v":0},{"$f":"C18+D18","v":0},{"$f":"SUM(F19:F103)","v":0},{"$f":"SUM(G19:G103)","v":0},{"$f":"SUM(H19:H103)","v":0},{"$f":"SUM(I19:I103)","v":0},{"$f":"G18-H18-I18","v":0},{"$f":"SUM(K19:K103)","v":0},{"$f":"J18+K18","v":0},{"$f":"E18-L18+F18","v":0}]
[1,{"$f":"IF(作成に係る計算表!AC4=\"\",\"\",作成に係る計算表!AC4)","v":""},{"$f":"IF(B19=\"\",\"\",作成に係る計算表!AD4)","v":""},{"$f":"IF(B19=\"\",\"\",作成に係る計算表!AF4)","v":""},{"$f":"IF(C19=\"\",\"\",C19+D19)","v":""},{"$f":"IF(B19=\"\",\"\",作成に係る計算表!AG4)","v":""},{"$f":"作成に係る計算表!AH4","v":""},{"$f":"作成に係る計算表!AI4","v":""},{"$f":"作成に係る計算表!AJ4","v":""},{"$f":"IF(G19=\"\",\"\",G19-H19-I19)","v":""},{"$f":"作成に係る計算表!AK4","v":""},{"$f":"IF(G19=\"\",\"\",J19+K19)","v":""},{"$f":"IF(G19=\"\",\"\",E19-L19+F19)","v":""}]
[2,{"$f":"IF(作成に係る計算表!AC5=\"\",\"\",作成に係る計算表!AC5)","v":""},{"$f":"IF(B20=\"\",\"\",作成に係る計算表!AD5)","v":""},{"$f":"IF(B20=\"\",\"\",作成に係る計算表!AF5)","v":""},{"$f":"IF(C20=\"\",\"\",C20+D20)","v":""},{"$f":"IF(B20=\"\",\"\",作成に係る計算表!AG5)","v":""},{"$f":"作成に係る計算表!AH5","v":""},{"$f":"作成に係る計算表!AI5","v":""},{"$f":"作成に係る計算表!AJ5","v":""},{"$f":"IF(G20=\"\",\"\",G20-H20-I20)","v":""},{"$f":"作成に係る計算表!AK5","v":""},{"$f":"IF(G20=\"\",\"\",J20+K20)","v":""},{"$f":"IF(G20=\"\",\"\",E20-L20+F20)","v":""}]
{"$rows_left_out":84}
{"sheet":"個人配布用","index":2,"n_rows":24,"n_cols":14,"rows_kept":24,"cut":false,"hidden":false,"merged":[[0,2,0,4],[1,11,1,13],[9,11,9,13],[10,1,13,1],[10,2,10,5],[10,6,10,11],[10,12,12,12],[10,13,13,13],[11,2,11,4],[11,6,11,9],[12,6,13,6],[12,10,13,10],[12,11,13,11],[2,1,5,1],[2,2,2,5],[2,6,2,11],[2,12,4,12],[2,13,5,13],[3,2,3,4],[3,6,3,9],[4,6,5,6],[4,10,5,10],[4,11,5,11],[17,11,17,13],[18,1,21,1],[18,2,18,5],[18,6,18,11],[18,12,20,12],[18,13,21,13],[19,2,19,4],[19,6,19,9],[20,6,21,6],[20,10,21,10],[20,11,21,11]]}
[null,"STEP⑨：","印刷開始No（報告書のNoを入力）",null,null,"→",1,"※連番で3名分が出力されます。"]
[null,{"$f":"協定参加者別!$A$4","v":"○○　　　年分【○○　年1月1日～○○　年12月31日】"},null,null,null,null,"中山間地域等直接支払交付金に係る所得計算表",null,null,null,null,{"$f":"協定参加者別!$K$7&協定参加者別!$M$7","v":"○○集落協定"}]
[null,"氏名","収入",null,null,null,"支出",null,null,null,null,null,"所得金額","備考"]
[null,null,"交付金",null,null,"役員報酬等","⑤　共同取組活動分",null,null,null,"⑨","⑩"]
[null,null,"①","②","③　","④","支出額\n","⑥　⑤のうち","⑦　⑤のうち","⑧","減価償却費","必要経費\n（⑧+⑨）"]
["No",null,"個人配分分","共同取組活動分","合計\n（①＋②）","個人が受領した額",null,"必要経費に該当しない支出額","減価償却資産\nの取得金額","差引計\n（⑤-⑥-⑦）",null,null,"（③-⑩＋④）"]
[{"$f":"G1","v":1},{"$f":"IF(VLOOKUP($A7,協定参加者別!$A$19:$N$103,B$24,FALSE)=\"\",\"\",VLOOKUP($A7,協定参加者別!$A$19:$N$103,B$24,FALSE))","v":""},{"$f":"IF(VLOOKUP($A7,協定参加者別!$A$19:$N$103,C$24,FALSE)=\"\",\"\",VLOOKUP($A7,協定参加者別!$A$19:$N$103,C$24,FALSE))","v":""},{"$f":"IF(VLOOKUP($A7,協定参加者別!$A$19:$N$103,D$24,FALSE)=\"\",\"\",VLOOKUP($A7,協定参加者別!$A$19:$N$103,D$24,FALSE))","v":""},{"$f":"IF(VLOOKUP($A7,協定参加者別!$A$19:$N$103,E$24,FALSE)=\"\",\"\",VLOOKUP($A7,協定参加者別!$A$19:$N$103,E$24,FALSE))","v":""},{"$f":"IF(VLOOKUP($A7,協定参加者別!$A$19:$N$103,F$24,FALSE)=\"\",\"\",VLOOKUP($A7,協定参加者別!$A$19:$N$103,F$24,FALSE))","v":""},{"$f":"IF(VLOOKUP($A7,協定参加者別!$A$19:$N$103,G$24,FALSE)=\"\",\"\",VLOOKUP($A7,協定参加者別!$A$19:$N$103,G$24,FALSE))","v":""},{"$f":"IF(VLOOKUP($A7,協定参加者別!$A$19:$N$103,H$24,FALSE)=\"\",\"\",VLOOKUP($A7,協定参加者別!$A$19:$N$103,H$24,FALSE))","v":""},{"$f":"IF(VLOOKUP($A7,協定参加者別!$A$19:$N$103,I$24,FALSE)=\"\",\"\",VLOOKUP($A7,協定参加者別!$A$19:$N$103,I$24,FALSE))","v":""},{"$f":"IF(VLOOKUP($A7,協定参加者別!$A$19:$N$103,J$24,FALSE)=\"\",\"\",VLOOKUP($A7,協定参加者別!$A$19:$N$103,J$24,FALSE))","v":""},{"$f":"IF(VLOOKUP($A7,協定参加者別!$A$19:$N$103,K$24,FALSE)=\"\",\"\",VLOOKUP($A7,協定参加者別!$A$19:$N$103,K$24,FALSE))","v":""},{"$f":"IF(VLOOKUP($A7,協定参加者別!$A$19:$N$103,L$24,FALSE)=\"\",\"\",VLOOKUP($A7,協定参加者別!$A$19:$N$103,L$24,FALSE))","v":""},{"$f":"IF(VLOOKUP($A7,協定参加者別!$A$19:$N$103,M$24,FALSE)=\"\",\"\",VLOOKUP($A7,協定参加者別!$A$19:$N$103,M$24,FALSE))","v":""},{"$f":"IF(VLOOKUP($A7,協定参加者別!$A$19:$N$103,N$24,FALSE)=\"\",\"\",VLOOKUP($A7,協定参加者別!$A$19:$N$103,N$24,FALSE))","v":""}]
[]
[]
[null,{"$f":"協定参加者別!$A$4","v":"○○　　　年分【○○　年1月1日～○○　年12月31日】"},null,null,null,null,"中山間地域等直接支払交付金に係る所得計算表",null,null,null,null,{"$f":"協定参加者別!$K$7&協定参加者別!$M$7","v":"○○集落協定"}]
[null,"氏名","収入",null,null,null,"支出",null,null,null,null,null,"所得金額","備考"]
[null,null,"交付金",null,null,"役員報酬等","⑤　共同取組活動分",null,null,null,"⑨","⑩"]
[null,null,"①","②","③　","④","支出額\n","⑥　⑤のうち","⑦　⑤のうち","⑧","減価償却費","必要経費\n（⑧+⑨）"]
[null,null,"個人配分分","共同取組活動分","合計\n（①＋②）","個人が受領した額",null,"必要経費に該当しない支出額","減価償却資産\nの取得金額","差引計\n（⑤-⑥-⑦）",null,null,"（③-⑩＋④）"]
[{"$f":"A7+1","v":2},{"$f":"IF(VLOOKUP($A15,協定参加者別!$A$19:$N$103,B$24,FALSE)=\"\",\"\",VLOOKUP($A15,協定参加者別!$A$19:$N$103,B$24,FALSE))","v":""},{"$f":"IF(VLOOKUP($A15,協定参加者別!$A$19:$N$103,C$24,FALSE)=\"\",\"\",VLOOKUP($A15,協定参加者別!$A$19:$N$103,C$24,FALSE))","v":""},{"$f":"IF(VLOOKUP($A15,協定参加者別!$A$19:$N$103,D$24,FALSE)=\"\",\"\",VLOOKUP($A15,協定参加者別!$A$19:$N$103,D$24,FALSE))","v":""},{"$f":"IF(VLOOKUP($A15,協定参加者別!$A$19:$N$103,E$24,FALSE)=\"\",\"\",VLOOKUP($A15,協定参加者別!$A$19:$N$103,E$24,FALSE))","v":""},{"$f":"IF(VLOOKUP($A15,協定参加者別!$A$19:$N$103,F$24,FALSE)=\"\",\"\",VLOOKUP($A15,協定参加者別!$A$19:$N$103,F$24,FALSE))","v":""},{"$f":"IF(VLOOKUP($A15,協定参加者別!$A$19:$N$103,G$24,FALSE)=\"\",\"\",VLOOKUP($A15,協定参加者別!$A$19:$N$103,G$24,FALSE))","v":""},{"$f":"IF(VLOOKUP($A15,協定参加者別!$A$19:$N$103,H$24,FALSE)=\"\",\"\",VLOOKUP($A15,協定参加者別!$A$19:$N$103,H$24,FALSE))","v":""},{"$f":"IF(VLOOKUP($A15,協定参加者別!$A$19:$N$103,I$24,FALSE)=\"\",\"\",VLOOKUP($A15,協定参加者別!$A$19:$N$103,I$24,FALSE))","v":""},{"$f":"IF(VLOOKUP($A15,協定参加者別!$A$19:$N$103,J$24,FALSE)=\"\",\"\",VLOOKUP($A15,協定参加者別!$A$19:$N$103,J$24,FALSE))","v":""},{"$f":"IF(VLOOKUP($A15,協定参加者別!$A$19:$N$103,K$24,FALSE)=\"\",\"\",VLOOKUP($A15,協定参加者別!$A$19:$N$103,K$24,FALSE))","v":""},{"$f":"IF(VLOOKUP($A15,協定参加者別!$A$19:$N$103,L$24,FALSE)=\"\",\"\",VLOOKUP($A15,協定参加者別!$A$19:$N$103,L$24,FALSE))","v":""},{"$f":"IF(VLOOKUP($A15,協定参加者別!$A$19:$N$103,M$24,FALSE)=\"\",\"\",VLOOKUP($A15,協定参加者別!$A$19:$N$103,M$24,FALSE))","v":""},{"$f":"IF(VLOOKUP($A15,協定参加者別!$A$19:$N$103,N$24,FALSE)=\"\",\"\",VLOOKUP($A15,協定参加者別!$A$19:$N$103,N$24,FALSE))","v":""}]
[]
[]
[null,{"$f":"協定参加者別!$A$4","v":"○○　　　年分【○○　年1月1日～○○　年12月31日】"},null,null,null,null,"中山間地域等直接支払交付金に係る所得計算表",null,null,null,null,{"$f":"協定参加者別!$K$7&協定参加者別!$M$7","v":"○○集落協定"}]
[null,"氏名","収入",null,null,null,"支出",null,null,null,null,null,"所得金額","備考"]
[null,null,"交付金",null,null,"役員報酬等","⑤　共同取組活動分",null,null,null,"⑨","⑩"]
{"$rows_left_out":5}
{"sheet":"減価償却計算","index":3,"n_rows":53,"n_cols":16,"rows_kept":53,"cut":false,"hidden":false,"merged":[[0,0,0,1],[2,0,2,1],[2,8,2,12],[3,0,3,1],[3,2,3,5],[3,8,3,12],[9,0,9,1],[8,4,8,5],[4,0,4,1],[4,2,4,5],[5,0,5,1],[6,0,6,1],[7,0,7,1],[8,0,8,1]]}
["減価償却費の計算",null,null,"平成19年4月1日以後取得（定額法）"]
[]
["申告年",null,30,null,null,null,null,null,"当該年中の減価償却費（一人当たり）",null,null,null,null,{"$f":"ROUNDDOWN(VLOOKUP($C$3,$A$14:$N$52,14,FALSE)/$C$9,0)","v":{"$error":"#DIV/0!"}},"円"]
["資産名称",null,"○○",null,null,null,null,null,"端数",null,null,null,null,{"$f":"VLOOKUP($C$3,$A$14:$N$52,14,FALSE)-N3*C9","v":{"$error":"#DIV/0!"}},"円"]
["取得価格",null,2000000]
["取得年月日",null,30,"年",5,"月"]
["耐用年数",null,7,"年（",{"$f":"C7*12","v":84},"か月）"]
["農業の使用割合",null,1]
["共有者数",null,{"$f":"作成に係る計算表!AE2","v":0},"一人当たり",{"$f":"IF(C5/C9<100000,\"対象外\",C5/C9)","v":{"$error":"#DIV/0!"}}]
["定額法償却率",null,{"$f":"VLOOKUP(C7,償却率!A1:B50,2,FALSE)","v":0.14299999999999999}]
[]
["年","減価償却の基礎となる金額\n（取得価格）",null,"定額法償却率",null,"1年間の減価償却費",null,"使用月数",null,"減価償却費",null,"農業の使用割合",null,"必要経費となる減価償却費","未償却残高"]
[null,"（円）",null,null,null,"（円）",null,"（月）",null,"（円）",null,"（％）",null,"（円）","（円）"]
[{"$f":"C6","v":30},{"$f":"$C$5","v":2000000},"×",{"$f":"$C$10","v":0.14299999999999999},"＝",{"$f":"ROUNDDOWN(B14*D14,0)","v":286000},"×",{"$f":"13-E6","v":8},"＝",{"$f":"ROUNDDOWN(F14*H14/12,0)","v":190666},"×",{"$f":"$C$8","v":1},"＝",{"$f":"J14*L14","v":190666},{"$f":"B14-N14","v":1809334},{"$f":"E7-H14","v":76}]
[{"$f":"A14+1","v":31},{"$f":"IF(P14=0,0,$C$5)","v":2000000},"×",0.14299999999999999,"＝",{"$f":"ROUNDDOWN(B15*D15,0)","v":286000},"×",{"$f":"IF(P14>=12,12,P14)","v":12},"＝",{"$f":"ROUNDDOWN(F15*H15/12,0)","v":286000},"×",1,"＝",{"$f":"IF(O14=0,0,IF(J15*L15>=O14,O14-1,J15*L15))","v":286000},{"$f":"IF(N15=0,0,O14-N15)","v":1523334},{"$f":"P14-H15","v":64}]
[{"$f":"A15+1","v":32},2000000,"×",0.14299999999999999,"＝",286000,"×",{"$f":"IF(P15>=12,12,P15)","v":12},"＝",286000,"×",1,"＝",{"$f":"IF(O15=0,0,IF(J16*L16>=O15,O15-1,J16*L16))","v":286000},{"$f":"IF(N16=0,0,O15-N16)","v":1237334},{"$f":"P15-H16","v":52}]
[33,2000000,"×",0.14299999999999999,"＝",286000,"×",12,"＝",286000,"×",1,"＝",286000,951334,40]
[34,2000000,"×",0.14299999999999999,"＝",286000,"×",12,"＝",286000,"×",1,"＝",286000,665334,28]
[35,2000000,"×",0.14299999999999999,"＝",286000,"×",12,"＝",286000,"×",1,"＝",286000,379334,16]
[36,2000000,"×",0.14299999999999999,"＝",286000,"×",12,"＝",286000,"×",1,"＝",286000,93334,4]
{"$rows_left_out":34}
{"sheet":"償却率","index":4,"n_rows":50,"n_cols":2,"rows_kept":50,"cut":false,"hidden":false,"merged":[]}
["耐用年数","償却率"]
[2,0.5]
[3,0.33400000000000002]
[4,0.25]
[5,0.2]
[6,0.16700000000000001]
[7,0.14299999999999999]
[8,0.125]
[9,0.112]
[10,0.1]
[11,9.0999999999999998E-2]
[12,8.4000000000000005E-2]
[13,7.6999999999999999E-2]
[14,7.1999999999999995E-2]
[15,6.7000000000000004E-2]
[16,6.3E-2]
[17,5.8999999999999997E-2]
[18,5.6000000000000001E-2]
[19,5.2999999999999999E-2]
[20,0.05]
{"$rows_left_out":31}
{"sheet":"作成に係る計算表 (記入例)","index":5,"n_rows":25,"n_cols":23,"rows_kept":25,"cut":false,"hidden":false,"merged":[[10,11,10,15],[10,16,10,25],[11,11,11,15],[11,16,11,25],[24,1,24,10],[24,11,24,15],[24,16,24,20],[24,21,24,25],[20,16,20,25],[21,2,21,10],[21,11,21,15],[21,16,21,25],[22,1,22,10],[22,11,22,15],[22,16,22,25],[20,2,20,10],[17,16,17,25],[14,2,14,10],[15,2,15,10],[14,11,14,15],[14,16,14,25],[15,11,15,15],[15,16,15,25],[16,11,16,15],[16,16,16,25],[16,2,16,10],[17,2,17,10],[11,3,11,10],[12,3,12,10],[12,11,12,15],[12,16,12,25],[7,8,7,12],[7,13,7,25],[9,1,9,10],[9,11,9,15],[9,16,9,25],[10,1,21,1],[13,3,13,10],[13,11,13,15],[13,16,13,25],[10,2,13,2],[10,3,10,10],[17,11,17,15],[0,0,0,25],[1,18,1,21],[6,1,6,7],[6,8,6,12],[7,1,7,7],[1,22,1,24],[4,1,4,7],[4,8,4,12],[4,13,4,25],[5,1,5,7],[5,8,5,12],[5,13,5,25],[6,13,6,25],[23,2,23,10],[23,11,23,15],[23,16,23,25],[18,2,18,10],[18,11,18,15],[18,16,18,25],[19,2,19,10],[19,11,19,15],[19,16,19,25],[20,11,20,15]]}
["収支状況報告書作成に係る計算表"]
[null,null,null,null,null,null,null,null,null,null,null,null,null,null,null,null,null,null,null,null,null,null,"集落協定"]
["１　交付金に係る配分額及び共同取組活動の支出額"]
["（１）配分総額"]
[null,null,null,null,null,null,null,null,"総  額（円）",null,null,null,null,"配分等の基礎"]
[null,"①個人配分分",null,null,null,null,null,null,330000,null,null,null,null,"交付金の５０％を面積で按分"]
[null,"②共同取組活動分",null,null,null,null,null,null,660000,null,null,null,null,"交付金の５０％を均等割りで按分\n（早期交付分330,000含む）"]
[null,"③合計",null,null,null,null,null,null,{"$f":"SUM(I6:M7)","v":990000}]
["（２）共同取組活動支出額"]
[null,"支出項目",null,null,null,null,null,null,null,null,null,"支出額（円）",null,null,null,null,"備考"]
[null,"⑤共同取組活動費","④役員報酬等","役員報酬",null,null,null,null,null,null,null,50000,null,null,null,null,"会長20,000×1名、役員10,000×3名"]
[null,null,null,"日当",null,null,null,null,null,null,null,50000,null,null,null,null,"作業日当　5,000円×10名"]
[null,null,null,"その他手当等"]
[null,null,null,"④合計額",null,null,null,null,null,null,null,{"$f":"SUM(L11:P13)","v":100000}]
[null,null,"鳥獣害防止対策費",null,null,null,null,null,null,null,null,150000,null,null,null,null,"防護柵資材代"]
[null,null,"水路・農道等の管理費",null,null,null,null,null,null,null,null,50000,null,null,null,null,"水路補修資材代"]
[null,null,"共同利用機械購入費",null,null,null,null,null,null,null,null,660000,null,null,null,null,"乗用草刈機　１台　共同所有"]
[]
[]
[]
{"$rows_left_out":6}
{"sheet":"協定参加者別 (記入例)","index":6,"n_rows":75,"n_cols":16,"rows_kept":75,"cut":false,"hidden":false,"merged":[[13,10,14,10],[13,11,14,11],[15,0,16,1],[12,6,12,9],[11,6,11,11],[0,12,0,13],[2,0,2,13],[3,0,3,13],[5,10,5,12],[7,10,7,12],[11,12,13,12],[11,0,14,0],[11,1,14,1],[11,13,14,13],[12,2,12,4],[11,2,11,5],[13,6,14,6]]}
[null,null,null,null,null,null,null,null,null,null,null,null,"平成　　　年　　　月　　　日"]
[]
[{"$f":"\"平成\"&P3&\"年分【平成\"&P3&\"年1月1日～平成\"&P3&\"年12月31日】\"","v":{"$error":"#REF!"}},null,null,null,null,null,null,null,null,null,null,null,null,null,"年→",{"$f":"協定参加者別!#REF!","v":{"$error":"#REF!"}}]
["確定申告に係る中山間地域等直接支払交付金収支状況報告書"]
[]
[null,null,null,null,null,null,null,null,null,"集落協定名","●●集落協定"]
[]
[null,null,null,null,null,null,null,null,null,"集落協定代表者","●●　●●",null,null,"㊞"]
[]
[null,null,null,null,null,null,null,null,null,"該当行政区名","●●町","　●●"]
[]
["No.","氏名","収入",null,null,null,"支出",null,null,null,null,null,"所得金額","備考"]
[null,null,"交付金",null,null,"役員報酬等","⑤　共同取組活動分",null,null,null,"⑨","⑩"]
[null,null,"①","②","③　","④","支出額\n","⑥　⑤のうち","⑦　⑤のうち","⑧","減価償却費","必要経費\n（⑧+⑨）"]
[null,null,"個人配分分","共同取組活動分","合計\n（①＋②）","②のうち個人が受領した額",null,"必要経費に該当しない支出額","減価償却資産\nの取得金額","差引計\n（⑤-⑥-⑦）",null,null,"（③-⑩＋④）"]
["集落合計",null,"円","円","円","円","円","円","円","円","円","円","円"]
[null,null,{"$f":"SUM(C18:C75)","v":330000},{"$f":"SUM(D18:D75)","v":660000},{"$f":"C17+D17","v":990000},{"$f":"SUM(F18:F75)","v":100000},{"$f":"SUM(G18:G75)","v":960000},{"$f":"SUM(H18:H75)","v":0},{"$f":"SUM(I18:I75)","v":660000},{"$f":"G17-H17-I17","v":300000},{"$f":"SUM(K18:K75)","v":62920},{"$f":"J17+K17","v":362920},{"$f":"E17-L17+F17","v":727080}]
[1,"○○　太郎",60000,132000,{"$f":"IF(C18=\"\",\"\",C18+D18)","v":192000},30000,192000,null,132000,{"$f":"IF(G18=\"\",\"\",G18-H18-I18)","v":60000},12584,{"$f":"IF(G18=\"\",\"\",J18+K18)","v":72584},{"$f":"IF(G18=\"\",\"\",E18-L18+F18)","v":149416}]
[2,"□□　二郎",70000,132000,202000,20000,192000,null,132000,60000,12584,72584,{"$f":"IF(G19=\"\",\"\",E19-L19+F19)","v":149416}]
[3,"△△　三郎",50000,132000,182000,20000,192000,null,132000,60000,12584,72584,129416]
{"$rows_left_out":55}