{"text_format":"1","workbook":"xlsx","n_sheets":8,"sheets":["1．作成に係る計算表","２．参加者別明細","３．収支状況報告書","個人配布用","減価償却計算","償却率","作成に係る計算表 (記入例)","協定参加者別 (記入例)"],"not_rendered":{"charts":0,"images":0,"macros":1,"external_links":0,"defined_names":9,"comments":2,"pivot_tables":0},"unopened":[],"bounds":{"document_bytes":16777216,"sheet_cells":100000,"rows_first":2000,"rows_last":500,"rows_between":2000,"halvings":0,"cell_chars":16384,"cell_head_chars":4096},"cells_cut":0,"cells_raw":0,"read":"whole","date_system":"1900"}

{"sheet":"1．作成に係る計算表","index":0,"n_rows":26,"n_cols":23,"rows_kept":26,"cut":false,"hidden":false,"merged":[[24,2,24,10],[11,2,14,2],[11,1,22,1],[15,2,15,10],[16,2,16,10],[17,2,17,10],[18,2,18,10],[19,2,19,10],[20,2,20,10],[21,2,21,10],[22,2,22,10],[23,1,23,10],[11,3,11,10],[12,3,12,10],[16,11,16,15],[15,16,15,25],[16,16,16,25],[17,11,17,15],[15,11,15,15],[23,11,23,15],[23,16,23,25],[19,16,19,25],[22,11,22,15],[19,11,19,15],[21,11,21,15],[21,16,21,25],[20,11,20,15],[25,16,25,20],[25,21,25,25],[10,1,10,10],[10,11,10,15],[25,11,25,15],[25,1,25,10],[24,11,24,15],[24,16,24,25],[20,16,20,25],[22,16,22,25],[10,16,10,25],[11,11,11,15],[17,16,17,25],[18,11,18,15],[18,16,18,25],[14,11,14,15],[8,1,8,7],[8,8,8,12],[8,13,8,25],[14,3,14,10],[13,16,13,25],[12,11,12,15],[12,16,12,25],[13,11,13,15],[14,16,14,25],[11,16,11,25],[13,3,13,10],[0,0,0,8],[0,9,0,17],[7,1,7,7],[7,8,7,12],[7,13,7,25],[1,0,1,25],[5,8,5,12],[5,13,5,25],[6,8,6,12],[6,13,6,25],[2,22,2,24],[5,1,5,7],[6,1,6,7],[0,19,0,21],[2,17,2,21]]}
["STEP①：下記の計算表の作成する。",null,null,null,null,null,null,null,null,"STEP②：共同取組配分方法の選択→",null,null,null,null,null,null,null,null,null,"均等割"]
["収支状況報告書作成に係る計算表"]
[null,null,null,null,null,null,null,null,null,null,null,null,null,null,null,null,null,null,null,null,null,null,"集落協定"]
["１　交付金に係る配分額及び共同取組活動の支出額"]
["（１）配分総額"]
[null,null,null,null,null,null,null,null,"総  額（円）",null,null,null,null,"配分等の基礎"]
[null,"①個人配分分"]
[null,"②共同取組活動分"]
[null,"③合計",null,null,null,null,null,null,{"$f":"SUM(I7:M8)","v":0}]
["（２）共同取組活動支出額"]
{"$rows_left_out":17}
{"sheet":"２．参加者別明細","index":1,"n_rows":88,"n_cols":36,"rows_kept":88,"cut":false,"hidden":false,"merged":[[0,0,0,9],[0,11,0,18],[0,32,0,33],[0,26,0,27],[0,28,0,29],[0,30,0,31]]}
["STEP③：参加者別に個人配分額、日当等受領額、共同取組割当の適用の有無を入力する。",null,null,null,null,null,null,null,null,null,null,"STEP④：端数がある場合は端数調整額を入力",null,null,null,null,null,null,null,null,null,null,null,null,null,null,"STEP⑤減価償却資産取得額を入力→",null,null,null,"STEP⑥原価償却費を入力→",null,null,null,null,"STEP⑦：協定参加者別シートへ移動"]
[null,"合計",{"$f":"SUM(C4:C88)","v":0},{"$f":"COUNTIF(D4:D88,\"有\")","v":0},{"$f":"SUM(E4:E88)","v":0},{"$f":"SUM(F4:F88)","v":0},{"$f":"SUM(G4:G88)","v":0},null,null,null,null,"合計",{"$f":"SUM(M4:M88)","v":0},{"$f":"'1．作成に係る計算表'!I8-M2","v":0},{"$f":"SUM(O4:O88)","v":0},{"$f":"'1．作成に係る計算表'!I8-O2","v":0},null,{"$f":"SUM(R4:R88)","v":0},{"$f":"'1．作成に係る計算表'!L24-R2","v":0},{"$f":"SUM(T4:T88)","v":0},{"$f":"'1．作成に係る計算表'!L24-T2","v":0},{"$f":"SUM(V4:V88)","v":0},{"$f":"'1．作成に係る計算表'!L25-V2","v":0},{"$f":"SUM(X4:X88)","v":0},{"$f":"'1．作成に係る計算表'!L25-X2","v":0},null,{"$f":"SUM(AA4:AA88)","v":0},{"$f":"AC1-AA2","v":0},{"$f":"SUM(AC4:AC88)","v":0},{"$f":"AC1-AC2","v":0},{"$f":"SUM(AE4:AE88)","v":0},{"$f":"AG1-AE2","v":0},{"$f":"SUM(AG4:AG88)","v":0},{"$f":"AG1-AG2","v":0}]
["No","参加者氏名\n↓","個人配分額\n↓","協定農用地の有無\n（共同取組割当の適用）\n※協定農用地に係る農業者は「有」を選択\n↓","共同取組割当額","日当等受領額\n↓","共同取組支出額","必要経費に該当しない支出額","原価償却資産取得費","原価償却費",null,"個人配分額順位","共同(均等割）\n端数切捨","端数調整↓","共同(面積割）\n端数切捨","端数調整↓","個人配分割合","共同支出額\n(均等割）端数切捨","端数調整↓","共同支出額\n(面積割）端数切捨","端数調整↓","経費以外\n支出額（均等割）","端数調整↓","経費以外\n支出額（面積割）","端数調整↓",null,"減価償却資産取得額（均等割）","端数調整↓","減価償却資産取得額（面積割）","端数調整↓","減価償却費（均等割）","端数調整↓","減価償却費（面積割）","端数調整↓"]
[1,null,null,null,{"$f":"IF(M4=\"\",\"\",IF('1．作成に係る計算表'!$T$1=\"均等割\",M4+N4,O4+P4))","v":""},null,{"$f":"IF(M4=\"\",\"\",IF('1．作成に係る計算表'!$T$1=\"均等割\",R4+S4,T4+U4))","v":""},{"$f":"IF(M4=\"\",\"\",IF('1．作成に係る計算表'!$T$1=\"均等割\",V4+W4,X4+Y4))","v":""},{"$f":"IF(M4=\"\",\"\",IF('1．作成に係る計算表'!$T$1=\"均等割\",AA4+AB4,AC4+AD4))","v":""},{"$f":"IF(M4=\"\",\"\",IF('1．作成に係る計算表'!$T$1=\"均等割\",AE4+AF4,AG4+AH4))","v":""},null,{"$f":"_xlfn.RANK.AVG(C4,$C$4:$C$88)","v":{"$error":"#N/A"}},{"$f":"IF(D4=\"有\",ROUNDDOWN('1．作成に係る計算表'!$I$8/$D$2,0),IF(D4=\"無\",0,\"\"))","v":""},null,{"$f":"IF(D4=\"有\",ROUNDDOWN('1．作成に係る計算表'!$I$8*Q4,0),IF(D4=\"無\",0,\"\"))","v":""},null,{"$f":"C4/SUMIFS($C$4:$C$88,$D$4:$D$88,\"有\")","v":{"$error":"#DIV/0!"}},{"$f":"IF(D4=\"有\",ROUNDDOWN('1．作成に係る計算表'!$L$24/$D$2,0),IF(D4=\"無\",0,\"\"))","v":""},null,{"$f":"IF(D4=\"有\",ROUNDDOWN('1．作成に係る計算表'!$L$24*Q4,0),IF(D4=\"無\",0,\"\"))","v":""},null,{"$f":"IF(D4=\"有\",ROUNDDOWN('1．作成に係る計算表'!$L$25/$D$2,0),IF(D4=\"無\",0,\"\"))","v":""},null,{"$f":"IF(D4=\"有\",ROUNDDOWN(Q4*'1．作成に係る計算表'!$L$25,0),IF(D4=\"無\",0,\"\"))","v":""},null,null,{"$f":"IF(D4=\"有\",ROUNDDOWN($AC$1/$D$2,0),IF(D4=\"無\",0,\"\"))","v":""},null,{"$f":"IF(D4=\"有\",ROUNDDOWN(Q4*$AC$1,0),IF(D4=\"無\",0,\"\"))","v":""},null,{"$f":"IF(D4=\"有\",ROUNDDOWN($AG$1/$D$2,0),IF(D4=\"無\",0,\"\"))","v":""},null,{"$f":"IF(D4=\"有\",ROUNDDOWN(Q4*$AG$1,0),IF(D4=\"無\",0,\"\"))","v":""}]
[2,null,null,null,{"$f":"IF(M5=\"\",\"\",IF('1．作成に係る計算表'!$T$1=\"均等割\",M5+N5,O5+P5))","v":""},null,{"$f":"IF(M5=\"\",\"\",IF('1．作成に係る計算表'!$T$1=\"均等割\",R5+S5,T5+U5))","v":""},{"$f":"IF(M5=\"\",\"\",IF('1．作成に係る計算表'!$T$1=\"均等割\",V5+W5,X5+Y5))","v":""},{"$f":"IF(M5=\"\",\"\",IF('1．作成に係る計算表'!$T$1=\"均等割\",AA5+AB5,AC5+AD5))","v":""},{"$f":"IF(M5=\"\",\"\",IF('1．作成に係る計算表'!$T$1=\"均等割\",AE5+AF5,AG5+AH5))","v":""},null,{"$error":"#N/A"},{"$f":"IF(D5=\"有\",ROUNDDOWN('1．作成に係る計算表'!$I$8/$D$2,0),IF(D5=\"無\",0,\"\"))","v":""},null,{"$f":"IF(D5=\"有\",ROUNDDOWN('1．作成に係る計算表'!$I$8*Q5,0),IF(D5=\"無\",0,\"\"))","v":""},null,{"$error":"#DIV/0!"},{"$f":"IF(D5=\"有\",ROUNDDOWN('1．作成に係る計算表'!$L$24/$D$2,0),IF(D5=\"無\",0,\"\"))","v":""},null,{"$f":"IF(D5=\"有\",ROUNDDOWN('1．作成に係る計算表'!$L$24*Q5,0),IF(D5=\"無\",0,\"\"))","v":""},null,{"$f":"IF(D5=\"有\",ROUNDDOWN('1．作成に係る計算表'!$L$25/$D$2,0),IF(D5=\"無\",0,\"\"))","v":""},null,{"$f":"IF(D5=\"有\",ROUNDDOWN(Q5*'1．作成に係る計算表'!$L$25,0),IF(D5=\"無\",0,\"\"))","v":""},null,null,"",null,"",null,"",null,""]
[3,null,null,null,{"$f":"IF(M6=\"\",\"\",IF('1．作成に係る計算表'!$T$1=\"均等割\",M6+N6,O6+P6))","v":""},null,{"$f":"IF(M6=\"\",\"\",IF('1．作成に係る計算表'!$T$1=\"均等割\",R6+S6,T6+U6))","v":""},{"$f":"IF(M6=\"\",\"\",IF('1．作成に係る計算表'!$T$1=\"均等割\",V6+W6,X6+Y6))","v":""},{"$f":"IF(M6=\"\",\"\",IF('1．作成に係る計算表'!$T$1=\"均等割\",AA6+AB6,AC6+AD6))","v":""},{"$f":"IF(M6=\"\",\"\",IF('1．作成に係る計算表'!$T$1=\"均等割\",AE6+AF6,AG6+AH6))","v":""},null,{"$error":"#N/A"},{"$f":"IF(D6=\"有\",ROUNDDOWN('1．作成に係る計算表'!$I$8/$D$2,0),IF(D6=\"無\",0,\"\"))","v":""},null,{"$f":"IF(D6=\"有\",ROUNDDOWN('1．作成に係る計算表'!$I$8*Q6,0),IF(D6=\"無\",0,\"\"))","v":""},null,{"$error":"#DIV/0!"},{"$f":"IF(D6=\"有\",ROUNDDOWN('1．作成に係る計算表'!$L$24/$D$2,0),IF(D6=\"無\",0,\"\"))","v":""},null,{"$f":"IF(D6=\"有\",ROUNDDOWN('1．作成に係る計算表'!$L$24*Q6,0),IF(D6=\"無\",0,\"\"))","v":""},null,{"$f":"IF(D6=\"有\",ROUNDDOWN('1．作成に係る計算表'!$L$25/$D$2,0),IF(D6=\"無\",0,\"\"))","v":""},null,{"$f":"IF(D6=\"有\",ROUNDDOWN(Q6*'1．作成に係る計算表'!$L$25,0),IF(D6=\"無\",0,\"\"))","v":""},null,null,"",null,"",null,"",null,""]
[4,null,null,null,{"$f":"IF(M7=\"\",\"\",IF('1．作成に係る計算表'!$T$1=\"均等割\",M7+N7,O7+P7))","v":""},null,{"$f":"IF(M7=\"\",\"\",IF('1．作成に係る計算表'!$T$1=\"均等割\",R7+S7,T7+U7))","v":""},{"$f":"IF(M7=\"\",\"\",IF('1．作成に係る計算表'!$T$1=\"均等割\",V7+W7,X7+Y7))","v":""},{"$f":"IF(M7=\"\",\"\",IF('1．作成に係る計算表'!$T$1=\"均等割\",AA7+AB7,AC7+AD7))","v":""},{"$f":"IF(M7=\"\",\"\",IF('1．作成に係る計算表'!$T$1=\"均等割\",AE7+AF7,AG7+AH7))","v":""},null,{"$error":"#N/A"},{"$f":"IF(D7=\"有\",ROUNDDOWN('1．作成に係る計算表'!$I$8/$D$2,0),IF(D7=\"無\",0,\"\"))","v":""},null,{"$f":"IF(D7=\"有\",ROUNDDOWN('1．作成に係る計算表'!$I$8*Q7,0),IF(D7=\"無\",0,\"\"))","v":""},null,{"$error":"#DIV/0!"},{"$f":"IF(D7=\"有\",ROUNDDOWN('1．作成に係る計算表'!$L$24/$D$2,0),IF(D7=\"無\",0,\"\"))","v":""},null,{"$f":"IF(D7=\"有\",ROUNDDOWN('1．作成に係る計算表'!$L$24*Q7,0),IF(D7=\"無\",0,\"\"))","v":""},null,{"$f":"IF(D7=\"有\",ROUNDDOWN('1．作成に係る計算表'!$L$25/$D$2,0),IF(D7=\"無\",0,\"\"))","v":""},null,{"$f":"IF(D7=\"有\",ROUNDDOWN(Q7*'1．作成に係る計算表'!$L$25,0),IF(D7=\"無\",0,\"\"))","v":""},null,null,"",null,"",null,"",null,""]
[5,null,null,null,{"$f":"IF(M8=\"\",\"\",IF('1．作成に係る計算表'!$T$1=\"均等割\",M8+N8,O8+P8))","v":""},null,{"$f":"IF(M8=\"\",\"\",IF('1．作成に係る計算表'!$T$1=\"均等割\",R8+S8,T8+U8))","v":""},{"$f":"IF(M8=\"\",\"\",IF('1．作成に係る計算表'!$T$1=\"均等割\",V8+W8,X8+Y8))","v":""},{"$f":"IF(M8=\"\",\"\",IF('1．作成に係る計算表'!$T$1=\"均等割\",AA8+AB8,AC8+AD8))","v":""},{"$f":"IF(M8=\"\",\"\",IF('1．作成に係る計算表'!$T$1=\"均等割\",AE8+AF8,AG8+AH8))","v":""},null,{"$error":"#N/A"},{"$f":"IF(D8=\"有\",ROUNDDOWN('1．作成に係る計算表'!$I$8/$D$2,0),IF(D8=\"無\",0,\"\"))","v":""},null,{"$f":"IF(D8=\"有\",ROUNDDOWN('1．作成に係る計算表'!$I$8*Q8,0),IF(D8=\"無\",0,\"\"))","v":""},null,{"$error":"#DIV/0!"},{"$f":"IF(D8=\"有\",ROUNDDOWN('1．作成に係る計算表'!$L$24/$D$2,0),IF(D8=\"無\",0,\"\"))","v":""},null,{"$f":"IF(D8=\"有\",ROUNDDOWN('1．作成に係る計算表'!$L$24*Q8,0),IF(D8=\"無\",0,\"\"))","v":""},null,{"$f":"IF(D8=\"有\",ROUNDDOWN('1．作成に係る計算表'!$L$25/$D$2,0),IF(D8=\"無\",0,\"\"))","v":""},null,{"$f":"IF(D8=\"有\",ROUNDDOWN(Q8*'1．作成に係る計算表'!$L$25,0),IF(D8=\"無\",0,\"\"))","v":""},null,null,"",null,"",null,"",null,""]
[6,null,null,null,{"$f":"IF(M9=\"\",\"\",IF('1．作成に係る計算表'!$T$1=\"均等割\",M9+N9,O9+P9))","v":""},null,{"$f":"IF(M9=\"\",\"\",IF('1．作成に係る計算表'!$T$1=\"均等割\",R9+S9,T9+U9))","v":""},{"$f":"IF(M9=\"\",\"\",IF('1．作成に係る計算表'!$T$1=\"均等割\",V9+W9,X9+Y9))","v":""},{"$f":"IF(M9=\"\",\"\",IF('1．作成に係る計算表'!$T$1=\"均等割\",AA9+AB9,AC9+AD9))","v":""},{"$f":"IF(M9=\"\",\"\",IF('1．作成に係る計算表'!$T$1=\"均等割\",AE9+AF9,AG9+AH9))","v":""},null,{"$error":"#N/A"},{"$f":"IF(D9=\"有\",ROUNDDOWN('1．作成に係る計算表'!$I$8/$D$2,0),IF(D9=\"無\",0,\"\"))","v":""},null,{"$f":"IF(D9=\"有\",ROUNDDOWN('1．作成に係る計算表'!$I$8*Q9,0),IF(D9=\"無\",0,\"\"))","v":""},null,{"$error":"#DIV/0!"},{"$f":"IF(D9=\"有\",ROUNDDOWN('1．作成に係る計算表'!$L$24/$D$2,0),IF(D9=\"無\",0,\"\"))","v":""},null,{"$f":"IF(D9=\"有\",ROUNDDOWN('1．作成に係る計算表'!$L$24*Q9,0),IF(D9=\"無\",0,\"\"))","v":""},null,{"$f":"IF(D9=\"有\",ROUNDDOWN('1．作成に係る計算表'!$L$25/$D$2,0),IF(D9=\"無\",0,\"\"))","v":""},null,{"$f":"IF(D9=\"有\",ROUNDDOWN(Q9*'1．作成に係る計算表'!$L$25,0),IF(D9=\"無\",0,\"\"))","v":""},null,null,"",null,"",null,"",null,""]
[7,null,null,null,{"$f":"IF(M10=\"\",\"\",IF('1．作成に係る計算表'!$T$1=\"均等割\",M10+N10,O10+P10))","v":""},null,{"$f":"IF(M10=\"\",\"\",IF('1．作成に係る計算表'!$T$1=\"均等割\",R10+S10,T10+U10))","v":""},{"$f":"IF(M10=\"\",\"\",IF('1．作成に係る計算表'!$T$1=\"均等割\",V10+W10,X10+Y10))","v":""},{"$f":"IF(M10=\"\",\"\",IF('1．作成に係る計算表'!$T$1=\"均等割\",AA10+AB10,AC10+AD10))","v":""},{"$f":"IF(M10=\"\",\"\",IF('1．作成に係る計算表'!$T$1=\"均等割\",AE10+AF10,AG10+AH10))","v":""},null,{"$error":"#N/A"},{"$f":"IF(D10=\"有\",ROUNDDOWN('1．作成に係る計算表'!$I$8/$D$2,0),IF(D10=\"無\",0,\"\"))","v":""},null,{"$f":"IF(D10=\"有\",ROUNDDOWN('1．作成に係る計算表'!$I$8*Q10,0),IF(D10=\"無\",0,\"\"))","v":""},null,{"$error":"#DIV/0!"},{"$f":"IF(D10=\"有\",ROUNDDOWN('1．作成に係る計算表'!$L$24/$D$2,0),IF(D10=\"無\",0,\"\"))","v":""},null,{"$f":"IF(D10=\"有\",ROUNDDOWN('1．作成に係る計算表'!$L$24*Q10,0),IF(D10=\"無\",0,\"\"))","v":""},null,{"$f":"IF(D10=\"有\",ROUNDDOWN('1．作成に係る計算表'!$L$25/$D$2,0),IF(D10=\"無\",0,\"\"))","v":""},null,{"$f":"IF(D10=\"有\",ROUNDDOWN(Q10*'1．作成に係る計算表'!$L$25,0),IF(D10=\"無\",0,\"\"))","v":""},null,null,"",null,"",null,"",null,""]
{"$rows_left_out":79}
{"sheet":"３．収支状況報告書","index":2,"n_rows":103,"n_cols":15,"rows_kept":103,"cut":false,"hidden":false,"merged":[[8,10,8,12],[14,11,15,11],[10,11,10,12],[12,13,15,13],[14,6,15,6],[12,12,14,12],[14,10,15,10],[12,0,15,0],[12,1,15,1],[12,6,12,11],[12,2,12,5],[13,2,13,4],[13,6,13,9],[3,0,3,13],[4,0,4,13],[6,10,6,11],[0,1,0,3],[1,12,1,13],[0,4,0,6]]}
[null,"STEP⑧：代表者名及び該当行政区を入力する。",null,null,"STEP⑨：申告対象年を入力する。→",null,null,"令和",5,"STEP⑩：印刷する。"]
[null,null,null,null,null,null,null,null,null,null,null,null,"2023-12-31"]
[]
[{"$f":"H1&I1&\"年分【\"&H1&I1&\"年1月1日～\"&H1&I1&\"年12月31日】\"","v":"令和5年分【令和5年1月1日～令和5年12月31日】"}]
["確定申告に係る中山間地域等直接支払交付金収支状況報告書"]
[]
[null,null,null,null,null,null,null,null,null,"集落協定名",{"$f":"IF('1．作成に係る計算表'!R3=\"\",\"\",'1．作成に係る計算表'!R3)","v":""},null,"集落協定"]
[]
[null,null,null,null,null,null,null,null,null,"集落協定代表者",null,null,null,"㊞"]
[]
{"$rows_left_out":94}
{"sheet":"個人配布用","index":3,"n_rows":24,"n_cols":14,"rows_kept":24,"cut":false,"hidden":false,"merged":[[17,11,17,13],[18,1,21,1],[18,2,18,5],[18,6,18,11],[18,12,20,12],[18,13,21,13],[19,2,19,4],[19,6,19,9],[20,6,21,6],[20,10,21,10],[20,11,21,11],[2,12,4,12],[2,13,5,13],[3,2,3,4],[3,6,3,9],[4,6,5,6],[4,10,5,10],[4,11,5,11],[0,2,0,4],[1,11,1,13],[9,11,9,13],[10,1,13,1],[10,2,10,5],[10,6,10,11],[10,12,12,12],[10,13,13,13],[11,2,11,4],[11,6,11,9],[12,6,13,6],[12,10,13,10],[12,11,13,11],[2,1,5,1],[2,2,2,5],[2,6,2,11]]}
[null,"STEP⑨：","印刷開始No（報告書のNoを入力）",null,null,"→",1,"※連番で3名分が出力されます。"]
[null,{"$f":"'３．収支状況報告書'!$A$4","v":"令和5年分【令和5年1月1日～令和5年12月31日】"},null,null,null,null,"中山間地域等直接支払交付金に係る所得計算表",null,null,null,null,{"$f":"'３．収支状況報告書'!$K$7&'３．収支状況報告書'!$M$7","v":"集落協定"}]
[null,"氏名","収入",null,null,null,"支出",null,null,null,null,null,"所得金額","備考"]
[null,null,"交付金",null,null,"役員報酬等","⑤　共同取組活動分",null,null,null,"⑨","⑩"]
[null,null,"①","②","③　","④","支出額\n","⑥　⑤のうち","⑦　⑤のうち","⑧","減価償却費","必要経費\n（⑧+⑨）"]
["No",null,"個人配分分","共同取組活動分","合計\n（①＋②）","個人が受領した額",null,"必要経費に該当しない支出額","減価償却資産\nの取得金額","差引計\n（⑤-⑥-⑦）",null,null,"（③-⑩＋④）"]
[{"$f":"G1","v":1},{"$f":"IF(VLOOKUP($A7,'３．収支状況報告書'!$A$19:$N$103,B$24,FALSE)=\"\",\"\",VLOOKUP($A7,'３．収支状況報告書'!$A$19:$N$103,B$24,FALSE))","v":""},{"$f":"IF(VLOOKUP($A7,'３．収支状況報告書'!$A$19:$N$103,C$24,FALSE)=\"\",\"\",VLOOKUP($A7,'３．収支状況報告書'!$A$19:$N$103,C$24,FALSE))","v":""},{"$f":"IF(VLOOKUP($A7,'３．収支状況報告書'!$A$19:$N$103,D$24,FALSE)=\"\",\"\",VLOOKUP($A7,'３．収支状況報告書'!$A$19:$N$103,D$24,FALSE))","v":""},{"$f":"IF(VLOOKUP($A7,'３．収支状況報告書'!$A$19:$N$103,E$24,FALSE)=\"\",\"\",VLOOKUP($A7,'３．収支状況報告書'!$A$19:$N$103,E$24,FALSE))","v":""},{"$f":"IF(VLOOKUP($A7,'３．収支状況報告書'!$A$19:$N$103,F$24,FALSE)=\"\",\"\",VLOOKUP($A7,'３．収支状況報告書'!$A$19:$N$103,F$24,FALSE))","v":""},{"$f":"IF(VLOOKUP($A7,'３．収支状況報告書'!$A$19:$N$103,G$24,FALSE)=\"\",\"\",VLOOKUP($A7,'３．収支状況報告書'!$A$19:$N$103,G$24,FALSE))","v":""},{"$f":"IF(VLOOKUP($A7,'３．収支状況報告書'!$A$19:$N$103,H$24,FALSE)=\"\",\"\",VLOOKUP($A7,'３．収支状況報告書'!$A$19:$N$103,H$24,FALSE))","v":""},{"$f":"IF(VLOOKUP($A7,'３．収支状況報告書'!$A$19:$N$103,I$24,FALSE)=\"\",\"\",VLOOKUP($A7,'３．収支状況報告書'!$A$19:$N$103,I$24,FALSE))","v":""},{"$f":"IF(VLOOKUP($A7,'３．収支状況報告書'!$A$19:$N$103,J$24,FALSE)=\"\",\"\",VLOOKUP($A7,'３．収支状況報告書'!$A$19:$N$103,J$24,FALSE))","v":""},{"$f":"IF(VLOOKUP($A7,'３．収支状況報告書'!$A$19:$N$103,K$24,FALSE)=\"\",\"\",VLOOKUP($A7,'３．収支状況報告書'!$A$19:$N$103,K$24,FALSE))","v":""},{"$f":"IF(VLOOKUP($A7,'３．収支状況報告書'!$A$19:$N$103,L$24,FALSE)=\"\",\"\",VLOOKUP($A7,'３．収支状況報告書'!$A$19:$N$103,L$24,FALSE))","v":""},{"$f":"IF(VLOOKUP($A7,'３．収支状況報告書'!$A$19:$N$103,M$24,FALSE)=\"\",\"\",VLOOKUP($A7,'３．収支状況報告書'!$A$19:$N$103,M$24,FALSE))","v":""},{"$f":"IF(VLOOKUP($A7,'３．収支状況報告書'!$A$19:$N$103,N$24,FALSE)=\"\",\"\",VLOOKUP($A7,'３．収支状況報告書'!$A$19:$N$103,N$24,FALSE))","v":""}]
[]
[]
[null,{"$f":"'３．収支状況報告書'!$A$4","v":"令和5年分【令和5年1月1日～令和5年12月31日】"},null,null,null,null,"中山間地域等直接支払交付金に係る所得計算表",null,null,null,null,{"$f":"'３．収支状況報告書'!$K$7&'３．収支状況報告書'!$M$7","v":"集落協定"}]
{"$rows_left_out":15}
{"sheet":"減価償却計算","index":4,"n_rows":53,"n_cols":16,"rows_kept":53,"cut":false,"hidden":false,"merged":[[9,0,9,1],[8,4,8,5],[4,0,4,1],[4,2,4,5],[5,0,5,1],[6,0,6,1],[7,0,7,1],[8,0,8,1],[0,0,0,1],[2,0,2,1],[2,8,2,12],[3,0,3,1],[3,2,3,5],[3,8,3,12]]}
["減価償却費の計算",null,null,"平成19年4月1日以後取得（定額法）"]
[]
["申告年",null,30,null,null,null,null,null,"当該年中の減価償却費（一人当たり）",null,null,null,null,{"$f":"ROUNDDOWN(VLOOKUP($C$3,$A$14:$N$52,14,FALSE)/$C$9,0)","v":{"$error":"#DIV/0!"}},"円"]
["資産名称",null,"○○",null,null,null,null,null,"端数",null,null,null,null,{"$f":"VLOOKUP($C$3,$A$14:$N$52,14,FALSE)-N3*C9","v":{"$error":"#DIV/0!"}},"円"]
["取得価格",null,2000000]
["取得年月日",null,30,"年",5,"月"]
["耐用年数",null,7,"年（",{"$f":"C7*12","v":84},"か月）"]
["農業の使用割合",null,1]
["共有者数",null,{"$f":"'２．参加者別明細'!D2","v":0},"一人当たり",{"$f":"IF(C5/C9<100000,\"対象外\",C5/C9)","v":{"$error":"#DIV/0!"}}]
["定額法償却率",null,{"$f":"VLOOKUP(C7,償却率!A1:B50,2,FALSE)","v":0.14299999999999999}]
{"$rows_left_out":44}
{"sheet":"償却率","index":5,"n_rows":50,"n_cols":2,"rows_kept":50,"cut":false,"hidden":false,"merged":[]}
["耐用年数","償却率"]
[2,0.5]
[3,0.33400000000000002]
[4,0.25]
[5,0.2]
[6,0.16700000000000001]
[7,0.14299999999999999]
[8,0.125]
[9,0.112]
[10,0.1]
{"$rows_left_out":41}
{"sheet":"作成に係る計算表 (記入例)","index":6,"n_rows":25,"n_cols":23,"rows_kept":25,"cut":false,"hidden":false,"merged":[[23,2,23,10],[23,11,23,15],[23,16,23,25],[18,2,18,10],[18,11,18,15],[18,16,18,25],[19,2,19,10],[19,11,19,15],[19,16,19,25],[20,11,20,15],[0,0,0,25],[1,18,1,21],[6,1,6,7],[6,8,6,12],[7,1,7,7],[1,22,1,24],[4,1,4,7],[4,8,4,12],[4,13,4,25],[5,1,5,7],[5,8,5,12],[5,13,5,25],[6,13,6,25],[11,3,11,10],[12,3,12,10],[12,11,12,15],[12,16,12,25],[7,8,7,12],[7,13,7,25],[9,1,9,10],[9,11,9,15],[9,16,9,25],[10,1,21,1],[13,3,13,10],[13,11,13,15],[13,16,13,25],[10,2,13,2],[10,3,10,10],[17,11,17,15],[17,16,17,25],[14,2,14,10],[15,2,15,10],[14,11,14,15],[14,16,14,25],[15,11,15,15],[15,16,15,25],[16,11,16,15],[16,16,16,25],[16,2,16,10],[17,2,17,10],[10,11,10,15],[10,16,10,25],[11,11,11,15],[11,16,11,25],[24,1,24,10],[24,11,24,15],[24,16,24,20],[24,21,24,25],[20,16,20,25],[21,2,21,10],[21,11,21,15],[21,16,21,25],[22,1,22,10],[22,11,22,15],[22,16,22,25],[20,2,20,10]]}
["収支状況報告書作成に係る計算表"]
[null,null,null,null,null,null,null,null,null,null,null,null,null,null,null,null,null,null,null,null,null,null,"集落協定"]
["１　交付金に係る配分額及び共同取組活動の支出額"]
["（１）配分総額"]
[null,null,null,null,null,null,null,null,"総  額（円）",null,null,null,null,"配分等の基礎"]
[null,"①個人配分分",null,null,null,null,null,null,330000,null,null,null,null,"交付金の５０％を面積で按分"]
[null,"②共同取組活動分",null,null,null,null,null,null,660000,null,null,null,null,"交付金の５０％を均等割りで按分\n（早期交付分330,000含む）"]
[null,"③合計",null,null,null,null,null,null,{"$f":"SUM(I6:M7)","v":990000}]
["（２）共同取組活動支出額"]
[null,"支出項目",null,null,null,null,null,null,null,null,null,"支出額（円）",null,null,null,null,"備考"]
{"$rows_left_out":16}
{"sheet":"協定参加者別 (記入例)","index":7,"n_rows":75,"n_cols":16,"rows_kept":75,"cut":false,"hidden":false,"merged":[[11,12,13,12],[11,0,14,0],[11,1,14,1],[11,13,14,13],[12,2,12,4],[11,2,11,5],[13,6,14,6],[0,12,0,13],[2,0,2,13],[3,0,3,13],[5,10,5,12],[7,10,7,12],[13,10,14,10],[13,11,14,11],[15,0,16,1],[12,6,12,9],[11,6,11,11]]}
[null,null,null,null,null,null,null,null,null,null,null,null,"平成　　　年　　　月　　　日"]
[]
[{"$f":"\"平成\"&P3&\"年分【平成\"&P3&\"年1月1日～平成\"&P3&\"年12月31日】\"","v":{"$error":"#REF!"}},null,null,null,null,null,null,null,null,null,null,null,null,null,"年→",{"$f":"'３．収支状況報告書'!#REF!","v":{"$error":"#REF!"}}]
["確定申告に係る中山間地域等直接支払交付金収支状況報告書"]
[]
[null,null,null,null,null,null,null,null,null,"集落協定名","●●集落協定"]
[]
[null,null,null,null,null,null,null,null,null,"集落協定代表者","●●　●●",null,null,"㊞"]
[]
[null,null,null,null,null,null,null,null,null,"該当行政区名","●●町","　●●"]
{"$rows_left_out":65}